Reaction Details
TargetD(3) dopamine receptor
LigandBDBM50042729
Substrate/Competitorn/a
Meas. Tech.ChEMBL_1444488 (CHEMBL3374188)
Ki 2.3±n/a nM
Citation Peng, XWang, QMishra, YXu, JReichert, DEMalik, MTaylor, MLuedtke, RRMach, RH Synthesis, pharmacological evaluation and molecular modeling studies of triazole containing dopamine D3 receptor ligands. Bioorg Med Chem Lett25:519-23 (2015) 
 
D(3) dopamine receptor
Name:D(3) dopamine receptor
Type:n/a
Mol. Mass.:44243.43
Organism:Homo sapiens (Human)
Description:n/a
Residue:400
BDBM50042729
NameBDBM50042729
Synonyms:CHEMBL3353914
TypeSmall organic molecule
Emp. Form.C25H33N5OS
Mol. Mass.451.627
SMILESCOc1ccccc1N1CCN(CCCCCc2cn(nn2)-c2ccc(SC)cc2)CC1