Reaction Details
TargetCathepsin K
LigandBDBM50042851
Substrate/Competitorn/a
Meas. Tech.ChEMBL_1444643 (CHEMBL3376641)
IC50>100000±n/a nM
Citation Grosche, PSirockin, FMac Sweeney, ARamage, PErbel, PMelkko, SBernardi, AHughes, NEllis, DCombrink, KDJarousse, NAltmann, E Structure-based design and optimization of potent inhibitors of the adenoviral protease. Bioorg Med Chem Lett25:438-43 (2015) 
 
Cathepsin K
Name:Cathepsin K
Type:Enzyme
Mol. Mass.:36975.68
Organism:Homo sapiens (Human)
Description:P43235
Residue:329
BDBM50042851
NameBDBM50042851
Synonyms:CHEMBL3354499
TypeSmall organic molecule
Emp. Form.C20H25Cl2N3O5S
Mol. Mass.490.401
SMILESCC[C@H](C(=O)N[C@H]1CCN(CC(=O)NC\C=C\S(C)(=O)=O)C1=O)c1cc(Cl)cc(Cl)c1