Reaction Details
TargetCathepsin K
LigandBDBM50042855
Substrate/Competitorn/a
Meas. Tech.ChEMBL_1444643 (CHEMBL3376641)
IC50>100000±n/a nM
Citation Grosche, PSirockin, FMac Sweeney, ARamage, PErbel, PMelkko, SBernardi, AHughes, NEllis, DCombrink, KDJarousse, NAltmann, E Structure-based design and optimization of potent inhibitors of the adenoviral protease. Bioorg Med Chem Lett25:438-43 (2015) 
 
Cathepsin K
Name:Cathepsin K
Type:Enzyme
Mol. Mass.:36975.68
Organism:Homo sapiens (Human)
Description:P43235
Residue:329
BDBM50042855
NameBDBM50042855
Synonyms:CHEMBL3354496
TypeSmall organic molecule
Emp. Form.C24H26Cl2N2O6S
Mol. Mass.541.444
SMILESCOc1ccc(cc1C(=O)C(C)(C)c1cc(Cl)cc(Cl)c1)C(=O)NCC(=O)NC\C=C\S(C)(=O)=O