Reaction Details
TargetDipeptidyl peptidase 1
LigandBDBM50042855
Substrate/Competitorn/a
Meas. Tech.ChEMBL_1444642 (CHEMBL3376640)
IC50>100000±n/a nM
Citation Grosche, PSirockin, FMac Sweeney, ARamage, PErbel, PMelkko, SBernardi, AHughes, NEllis, DCombrink, KDJarousse, NAltmann, E Structure-based design and optimization of potent inhibitors of the adenoviral protease. Bioorg Med Chem Lett25:438-43 (2015) 
 
Dipeptidyl peptidase 1
Name:Dipeptidyl peptidase 1
Type:Enzyme
Mol. Mass.:51857.28
Organism:Homo sapiens (Human)
Description:P53634
Residue:463
BDBM50042855
NameBDBM50042855
Synonyms:CHEMBL3354496
TypeSmall organic molecule
Emp. Form.C24H26Cl2N2O6S
Mol. Mass.541.444
SMILESCOc1ccc(cc1C(=O)C(C)(C)c1cc(Cl)cc(Cl)c1)C(=O)NCC(=O)NC\C=C\S(C)(=O)=O