Reaction Details
TargetCathepsin B
LigandBDBM50042854
Substrate/Competitorn/a
Meas. Tech.ChEMBL_1444641 (CHEMBL3376639)
IC50>100000±n/a nM
Citation Grosche, PSirockin, FMac Sweeney, ARamage, PErbel, PMelkko, SBernardi, AHughes, NEllis, DCombrink, KDJarousse, NAltmann, E Structure-based design and optimization of potent inhibitors of the adenoviral protease. Bioorg Med Chem Lett25:438-43 (2015) 
 
Cathepsin B
Name:Cathepsin B
Type:Enzyme
Mol. Mass.:37819.69
Organism:Homo sapiens (Human)
Description:gi_63102437
Residue:339
BDBM50042854
NameBDBM50042854
Synonyms:CHEMBL3354497
TypeSmall organic molecule
Emp. Form.C20H27Cl2N3O5S
Mol. Mass.492.416
SMILESCC(C)(C)[C@H](NC(=O)Cc1cc(Cl)cc(Cl)c1)C(=O)NCC(=O)NC\C=C\S(C)(=O)=O