Reaction Details
TargetCathepsin B
LigandBDBM50042858
Substrate/Competitorn/a
Meas. Tech.ChEMBL_1444641 (CHEMBL3376639)
IC50>100000±n/a nM
Citation Grosche, PSirockin, FMac Sweeney, ARamage, PErbel, PMelkko, SBernardi, AHughes, NEllis, DCombrink, KDJarousse, NAltmann, E Structure-based design and optimization of potent inhibitors of the adenoviral protease. Bioorg Med Chem Lett25:438-43 (2015) 
 
Cathepsin B
Name:Cathepsin B
Type:Enzyme
Mol. Mass.:37819.69
Organism:Homo sapiens (Human)
Description:gi_63102437
Residue:339
BDBM50042858
NameBDBM50042858
Synonyms:CHEMBL3354493
TypeSmall organic molecule
Emp. Form.C25H28Cl2N4O4
Mol. Mass.519.42
SMILESCN(C)CCOc1ccc(cc1C(=O)C(C)(C)c1cc(Cl)cc(Cl)c1)C(=O)NCC(=O)NCC#N