Reaction Details
TargetSerine/threonine-protein kinase pim-1
LigandBDBM50042868
Substrate/Competitorn/a
Meas. Tech.ChEMBL_1444648 (CHEMBL3376646)
IC50 1.000000±n/a nM
Citation Ishchenko, AZhang, LLe Brazidec, JYFan, JChong, JHHingway, ARaditsis, ASingh, LElenbaas, BHong, VSMarcotte, DSilvian, LEnyedy, IChao, J Structure-based design of low-nanomolar PIM kinase inhibitors. Bioorg Med Chem Lett25:474-80 (2015) 
 
Serine/threonine-protein kinase pim-1
Name:Serine/threonine-protein kinase pim-1
Type:Protein
Mol. Mass.:35681.82
Organism:Homo sapiens (Human)
Description:P11309
Residue:313
BDBM50042868
NameBDBM50042868
Synonyms:CHEMBL3354518
TypeSmall organic molecule
Emp. Form.C19H17F2N5O2S
Mol. Mass.417.432
SMILESNc1sc(nc1C(=O)Nc1cnccc1O[C@H]1CCNC1)-c1c(F)cccc1F