Reaction Details
TargetSerine/threonine-protein kinase pim-3
LigandBDBM50042871
Substrate/Competitorn/a
Meas. Tech.ChEMBL_1444650 (CHEMBL3376648)
IC50 1.000000±n/a nM
Citation Ishchenko, AZhang, LLe Brazidec, JYFan, JChong, JHHingway, ARaditsis, ASingh, LElenbaas, BHong, VSMarcotte, DSilvian, LEnyedy, IChao, J Structure-based design of low-nanomolar PIM kinase inhibitors. Bioorg Med Chem Lett25:474-80 (2015) 
 
Serine/threonine-protein kinase pim-3
Name:Serine/threonine-protein kinase pim-3
Type:Protein
Mol. Mass.:35888.19
Organism:Homo sapiens (Human)
Description:Q86V86
Residue:326
BDBM50042871
NameBDBM50042871
Synonyms:CHEMBL3354521
TypeSmall organic molecule
Emp. Form.C22H20F2N4O2
Mol. Mass.410.4166
SMILESFc1cccc(F)c1-c1cccc(n1)C(=O)Nc1cnccc1OC1CCNCC1