Reaction Details
TargetCannabinoid receptor 1
LigandBDBM50042884
Substrate/Competitorn/a
Meas. Tech.ChEMBL_1444652 (CHEMBL3376650)
EC50>20000±n/a nM
Citation Bartolozzi, ACirillo, PFBerry, AKHickey, ERThomson, DSWu, LZindell, RAlbrecht, CCeci, AGemkow, MJNagaraja, NVRomig, HSauer, ARiether, D Selective CB2 receptor agonists. Part 3: the optimization of a piperidine-based series that demonstrated efficacy in an in vivo neuropathic pain model. Bioorg Med Chem Lett25:587-92 (2015) 
 
Cannabinoid receptor 1
Name:Cannabinoid receptor 1
Type:G Protein-Coupled Receptor (GPCR)
Mol. Mass.:52868.96
Organism:Homo sapiens (Human)
Description:P21554
Residue:472
BDBM50042884
NameBDBM50042884
Synonyms:CHEMBL3354544
TypeSmall organic molecule
Emp. Form.C19H29N3O5S
Mol. Mass.411.516
SMILESCC(C)(C)c1cc(NC(=O)[C@@H]2CCCCN2C(=O)C2CCS(=O)(=O)CC2)no1