Reaction Details
TargetCannabinoid receptor 1
LigandBDBM50042891
Substrate/Competitorn/a
Meas. Tech.ChEMBL_1444652 (CHEMBL3376650)
EC50 600±n/a nM
Citation Bartolozzi, ACirillo, PFBerry, AKHickey, ERThomson, DSWu, LZindell, RAlbrecht, CCeci, AGemkow, MJNagaraja, NVRomig, HSauer, ARiether, D Selective CB2 receptor agonists. Part 3: the optimization of a piperidine-based series that demonstrated efficacy in an in vivo neuropathic pain model. Bioorg Med Chem Lett25:587-92 (2015) 
 
Cannabinoid receptor 1
Name:Cannabinoid receptor 1
Type:G Protein-Coupled Receptor (GPCR)
Mol. Mass.:52868.96
Organism:Homo sapiens (Human)
Description:P21554
Residue:472
BDBM50042891
NameBDBM50042891
Synonyms:CHEMBL3354535
TypeSmall organic molecule
Emp. Form.C19H31N3O3
Mol. Mass.349.4677
SMILESCC(C)(C)c1cc(NC(=O)[C@@H]2CCCCN2CC2CCOCC2)no1