Reaction Details
TargetCannabinoid receptor 2
LigandBDBM50042915
Substrate/Competitorn/a
Meas. Tech.ChEMBL_1444651 (CHEMBL3376649)
EC50>1000±n/a nM
Citation Bartolozzi, ACirillo, PFBerry, AKHickey, ERThomson, DSWu, LZindell, RAlbrecht, CCeci, AGemkow, MJNagaraja, NVRomig, HSauer, ARiether, D Selective CB2 receptor agonists. Part 3: the optimization of a piperidine-based series that demonstrated efficacy in an in vivo neuropathic pain model. Bioorg Med Chem Lett25:587-92 (2015) 
 
Cannabinoid receptor 2
Name:Cannabinoid receptor 2
Type:G Protein-Coupled Receptor (GPCR)
Mol. Mass.:39690.94
Organism:Homo sapiens (Human)
Description:P34972
Residue:360
BDBM50042915
NameBDBM50042915
Synonyms:CHEMBL3354550
TypeSmall organic molecule
Emp. Form.C23H37N5O4
Mol. Mass.447.571
SMILESCC(C)(C)C(=O)N1CCN(CC1)C(=O)N1CCCC[C@H]1C(=O)Nc1cc(on1)C(C)(C)C