Reaction Details
TargetPhosphatidylinositol 4-phosphate 3-kinase C2 domain-containing subunit beta
LigandBDBM50042922
Substrate/Competitorn/a
Meas. Tech.ChEMBL_1444672 (CHEMBL3376670)
IC50 462±n/a nM
Citation Mountford, SJZheng, ZSundaram, KJennings, IGHamilton, JRThompson, PE Class II but Not Second Class-Prospects for the Development of Class II PI3K Inhibitors. ACS Med Chem Lett6:3-6 (2015) 
 
Phosphatidylinositol 4-phosphate 3-kinase C2 domain-containing subunit beta
Name:Phosphatidylinositol 4-phosphate 3-kinase C2 domain-containing subunit beta
Type:Enzyme
Mol. Mass.:184784.86
Organism:Homo sapiens (Human)
Description:O00750
Residue:1634
BDBM50042922
NameBDBM50042922
Synonyms:CHEMBL3218581
TypeSmall organic molecule
Emp. Form.C17H23N5O2S2
Mol. Mass.393.527
SMILESCc1nc(NC(=O)N2CCC[C@H]2C(N)=O)sc1-c1csc(n1)C(C)(C)C