Reaction Details
TargetPhosphatidylinositol 4-phosphate 3-kinase C2 domain-containing subunit beta
LigandBDBM50042925
Substrate/Competitorn/a
Meas. Tech.ChEMBL_1444672 (CHEMBL3376670)
IC50 370±n/a nM
Citation Mountford, SJZheng, ZSundaram, KJennings, IGHamilton, JRThompson, PE Class II but Not Second Class-Prospects for the Development of Class II PI3K Inhibitors. ACS Med Chem Lett6:3-6 (2015) 
 
Phosphatidylinositol 4-phosphate 3-kinase C2 domain-containing subunit beta
Name:Phosphatidylinositol 4-phosphate 3-kinase C2 domain-containing subunit beta
Type:Enzyme
Mol. Mass.:184784.86
Organism:Homo sapiens (Human)
Description:O00750
Residue:1634
BDBM50042925
NameBDBM50042925
Synonyms:CHEMBL3218571
TypeSmall organic molecule
Emp. Form.C19H12ClFN2O3S2
Mol. Mass.434.892
SMILESFc1ccc(CN2C(=O)COc3ccc(\C=C4\SC(=S)NC4=O)cc23)cc1Cl