Reaction Details
TargetPhosphatidylinositol 4,5-bisphosphate 3-kinase catalytic subunit alpha isoform
LigandBDBM81368
Substrate/Competitorn/a
Meas. Tech.ChEMBL_1444678 (CHEMBL3377240)
IC50 11±n/a nM
Citation Mountford, SJZheng, ZSundaram, KJennings, IGHamilton, JRThompson, PE Class II but Not Second Class-Prospects for the Development of Class II PI3K Inhibitors. ACS Med Chem Lett6:3-6 (2015) 
 
Phosphatidylinositol 4,5-bisphosphate 3-kinase catalytic subunit alpha isoform
Name:Phosphatidylinositol 4,5-bisphosphate 3-kinase catalytic subunit alpha isoform
Type:Enzyme Subunit
Mol. Mass.:124294.87
Organism:Homo sapiens (Human)
Description:P42336
Residue:1068
BDBM81368
NameBDBM81368
Synonyms:PIK90
TypeSmall organic molecule
Emp. Form.C18H17N5O3
Mol. Mass.351.3593
SMILESCOc1ccc2C3=NCCN3C(NC(=O)c3cccnc3)=Nc2c1OC