Reaction Details
TargetSerine/threonine-protein kinase mTOR
LigandBDBM12915
Substrate/Competitorn/a
Meas. Tech.ChEMBL_1444680 (CHEMBL3377242)
IC50 3900±n/a nM
Citation Mountford, SJZheng, ZSundaram, KJennings, IGHamilton, JRThompson, PE Class II but Not Second Class-Prospects for the Development of Class II PI3K Inhibitors. ACS Med Chem Lett6:3-6 (2015) 
 
Serine/threonine-protein kinase mTOR
Name:Serine/threonine-protein kinase mTOR
Type:Rapamycin target protein
Mol. Mass.:288917.12
Organism:Homo sapiens (Human)
Description:P42345
Residue:2549
BDBM12915
NameBDBM12915
Synonyms:2-(4-Morpholinyl)-8-phenyl-4H-1-benzopyran-4-one CHEMBL98350 US10308662, Compound LY294002 | US9505780, LY294002
TypeSmall organic molecule
Emp. Form.C19H17NO3
Mol. Mass.307.3432
SMILESO=c1cc(oc2c(cccc12)-c1ccccc1)N1CCOCC1