Reaction Details
TargetSerine/threonine-protein kinase Sgk1
LigandBDBM50043020
Substrate/Competitorn/a
Meas. Tech.ChEMBL_1444807 (CHEMBL3379050)
IC50<1.5±n/a nM
Citation Rosse, G Novel azaindazole sulfonamides inhibitors of serum and glucocorticoid regulated kinase. ACS Med Chem Lett6:19-20 (2015) 
 
Serine/threonine-protein kinase Sgk1
Name:Serine/threonine-protein kinase Sgk1
Type:Other Protein Type
Mol. Mass.:48954.40
Organism:Homo sapiens (Human)
Description:Recombinant human SGK-1 enzyme produced in a baculovirus system.
Residue:431
BDBM50043020
NameBDBM50043020
Synonyms:CHEMBL3355030
TypeSmall organic molecule
Emp. Form.C25H26FN5O5S
Mol. Mass.527.568
SMILESCOc1ccc(F)c(c1)S(=O)(=O)Nc1ccc(cc1)-c1nc(O[C@H]2CC[C@H](O)CC2)c2c(C)n[nH]c2n1