Reaction Details
TargetSerine/threonine-protein kinase Sgk1
LigandBDBM50043015
Substrate/Competitorn/a
Meas. Tech.ChEMBL_1444808 (CHEMBL3379051)
IC50 830±n/a nM
Citation Rosse, G Novel azaindazole sulfonamides inhibitors of serum and glucocorticoid regulated kinase. ACS Med Chem Lett6:19-20 (2015) 
 
Serine/threonine-protein kinase Sgk1
Name:Serine/threonine-protein kinase Sgk1
Type:Other Protein Type
Mol. Mass.:48954.40
Organism:Homo sapiens (Human)
Description:Recombinant human SGK-1 enzyme produced in a baculovirus system.
Residue:431
BDBM50043015
NameBDBM50043015
Synonyms:CHEMBL3355025 | US9718825, Example 1
TypeSmall organic molecule
Emp. Form.C18H13Cl2N5O2S
Mol. Mass.434.299
SMILESCc1n[nH]c2nc(ncc12)-c1ccc(NS(=O)(=O)c2cc(Cl)ccc2Cl)cc1