Reaction Details
TargetSerine/threonine-protein kinase Sgk1
LigandBDBM50043022
Substrate/Competitorn/a
Meas. Tech.ChEMBL_1444808 (CHEMBL3379051)
IC50 150±n/a nM
Citation Rosse, G Novel azaindazole sulfonamides inhibitors of serum and glucocorticoid regulated kinase. ACS Med Chem Lett6:19-20 (2015) 
 
Serine/threonine-protein kinase Sgk1
Name:Serine/threonine-protein kinase Sgk1
Type:Other Protein Type
Mol. Mass.:48954.40
Organism:Homo sapiens (Human)
Description:Recombinant human SGK-1 enzyme produced in a baculovirus system.
Residue:431
BDBM50043022
NameBDBM50043022
Synonyms:CHEMBL3355032
TypeSmall organic molecule
Emp. Form.C21H18FN5O2S
Mol. Mass.423.463
SMILESCc1ccc(F)c(c1)S(=O)(=O)Nc1ccc(cc1)-c1nc(C2CC2)c2cn[nH]c2n1