Reaction Details
TargetSerine/threonine-protein kinase Sgk1
LigandBDBM50043024
Substrate/Competitorn/a
Meas. Tech.ChEMBL_1444808 (CHEMBL3379051)
IC50 220±n/a nM
Citation Rosse, G Novel azaindazole sulfonamides inhibitors of serum and glucocorticoid regulated kinase. ACS Med Chem Lett6:19-20 (2015) 
 
Serine/threonine-protein kinase Sgk1
Name:Serine/threonine-protein kinase Sgk1
Type:Other Protein Type
Mol. Mass.:48954.40
Organism:Homo sapiens (Human)
Description:Recombinant human SGK-1 enzyme produced in a baculovirus system.
Residue:431
BDBM50043024
NameBDBM50043024
Synonyms:CHEMBL3355034 | US9718825, Example 310
TypeSmall organic molecule
Emp. Form.C21H20Cl2N6O3S
Mol. Mass.507.393
SMILESCC(C)COc1nc(nc2[nH]nc(N)c12)-c1ccc(NS(=O)(=O)c2cc(Cl)ccc2Cl)cc1