Reaction Details
TargetSerine/threonine-protein kinase Sgk1
LigandBDBM50043025
Substrate/Competitorn/a
Meas. Tech.ChEMBL_1444808 (CHEMBL3379051)
IC50 61±n/a nM
Citation Rosse, G Novel azaindazole sulfonamides inhibitors of serum and glucocorticoid regulated kinase. ACS Med Chem Lett6:19-20 (2015) 
 
Serine/threonine-protein kinase Sgk1
Name:Serine/threonine-protein kinase Sgk1
Type:Other Protein Type
Mol. Mass.:48954.40
Organism:Homo sapiens (Human)
Description:Recombinant human SGK-1 enzyme produced in a baculovirus system.
Residue:431
BDBM50043025
NameBDBM50043025
Synonyms:CHEMBL3355035 | US9718825, Example 520
TypeSmall organic molecule
Emp. Form.C22H19N7O3S
Mol. Mass.461.496
SMILESCOc1ccc(C#N)c(c1)S(=O)(=O)Nc1ccc(cc1)-c1nc(C2CC2)c2c(N)n[nH]c2n1