Reaction Details
TargetCalcium/calmodulin-dependent protein kinase type II subunit gamma
LigandBDBM50043341
Substrate/Competitorn/a
Meas. Tech.ChEMBL_1444822 (CHEMBL3379065)
IC50 1000000±n/a nM
Citation Johnson, CNBerdini, VBeke, LBonnet, PBrehmer, DCoyle, JEDay, PJFrederickson, MFreyne, EJGilissen, RAHamlett, CCHoward, SMeerpoel, LMcMenamin, RPatel, SRees, DCSharff, ASommen, FWu, TLinders, JT Fragment-based discovery of type I inhibitors of maternal embryonic leucine zipper kinase. ACS Med Chem Lett6:25-30 (2015) 
 
Calcium/calmodulin-dependent protein kinase type II subunit gamma
Name:Calcium/calmodulin-dependent protein kinase type II subunit gamma
Type:Protein
Mol. Mass.:62621.56
Organism:Homo sapiens (Human)
Description:Q13555
Residue:558
BDBM50043341
NameBDBM50043341
Synonyms:CHEMBL3355059
TypeSmall organic molecule
Emp. Form.C21H22N4O2
Mol. Mass.362.425
SMILESCOc1cc(ccc1C(=O)Nc1ccc2CCNCCc2c1)-c1cn[nH]c1