Reaction Details
TargetMAP kinase-interacting serine/threonine-protein kinase 2
LigandBDBM50043341
Substrate/Competitorn/a
Meas. Tech.ChEMBL_1444820 (CHEMBL3379063)
IC50 760000±n/a nM
Citation Johnson, CNBerdini, VBeke, LBonnet, PBrehmer, DCoyle, JEDay, PJFrederickson, MFreyne, EJGilissen, RAHamlett, CCHoward, SMeerpoel, LMcMenamin, RPatel, SRees, DCSharff, ASommen, FWu, TLinders, JT Fragment-based discovery of type I inhibitors of maternal embryonic leucine zipper kinase. ACS Med Chem Lett6:25-30 (2015) 
 
MAP kinase-interacting serine/threonine-protein kinase 2
Name:MAP kinase-interacting serine/threonine-protein kinase 2
Type:Protein
Mol. Mass.:51870.79
Organism:Homo sapiens (Human)
Description:Q9HBH9
Residue:465
BDBM50043341
NameBDBM50043341
Synonyms:CHEMBL3355059
TypeSmall organic molecule
Emp. Form.C21H22N4O2
Mol. Mass.362.425
SMILESCOc1cc(ccc1C(=O)Nc1ccc2CCNCCc2c1)-c1cn[nH]c1