Reaction Details
TargetReceptor-type tyrosine-protein kinase FLT3
LigandBDBM50043341
Substrate/Competitorn/a
Meas. Tech.ChEMBL_1444816 (CHEMBL3379059)
IC50 18000±n/a nM
Citation Johnson, CNBerdini, VBeke, LBonnet, PBrehmer, DCoyle, JEDay, PJFrederickson, MFreyne, EJGilissen, RAHamlett, CCHoward, SMeerpoel, LMcMenamin, RPatel, SRees, DCSharff, ASommen, FWu, TLinders, JT Fragment-based discovery of type I inhibitors of maternal embryonic leucine zipper kinase. ACS Med Chem Lett6:25-30 (2015) 
 
Receptor-type tyrosine-protein kinase FLT3
Name:Receptor-type tyrosine-protein kinase FLT3
Type:Enzyme
Mol. Mass.:112888.62
Organism:Homo sapiens (Human)
Description:P36888
Residue:993
BDBM50043341
NameBDBM50043341
Synonyms:CHEMBL3355059
TypeSmall organic molecule
Emp. Form.C21H22N4O2
Mol. Mass.362.425
SMILESCOc1cc(ccc1C(=O)Nc1ccc2CCNCCc2c1)-c1cn[nH]c1