Reaction Details
TargetMaternal embryonic leucine zipper kinase
LigandBDBM50043341
Substrate/Competitorn/a
Meas. Tech.ChEMBL_1444814 (CHEMBL3379057)
IC50 23000±n/a nM
Citation Johnson, CNBerdini, VBeke, LBonnet, PBrehmer, DCoyle, JEDay, PJFrederickson, MFreyne, EJGilissen, RAHamlett, CCHoward, SMeerpoel, LMcMenamin, RPatel, SRees, DCSharff, ASommen, FWu, TLinders, JT Fragment-based discovery of type I inhibitors of maternal embryonic leucine zipper kinase. ACS Med Chem Lett6:25-30 (2015) 
 
Maternal embryonic leucine zipper kinase
Name:Maternal embryonic leucine zipper kinase
Type:Enzyme
Mol. Mass.:74665.45
Organism:Homo sapiens (Human)
Description:Q14680
Residue:651
BDBM50043341
NameBDBM50043341
Synonyms:CHEMBL3355059
TypeSmall organic molecule
Emp. Form.C21H22N4O2
Mol. Mass.362.425
SMILESCOc1cc(ccc1C(=O)Nc1ccc2CCNCCc2c1)-c1cn[nH]c1