Reaction Details
TargetMaternal embryonic leucine zipper kinase
LigandBDBM50043344
Substrate/Competitorn/a
Meas. Tech.ChEMBL_1444812 (CHEMBL3379055)
IC50 31000±n/a nM
Citation Johnson, CNBerdini, VBeke, LBonnet, PBrehmer, DCoyle, JEDay, PJFrederickson, MFreyne, EJGilissen, RAHamlett, CCHoward, SMeerpoel, LMcMenamin, RPatel, SRees, DCSharff, ASommen, FWu, TLinders, JT Fragment-based discovery of type I inhibitors of maternal embryonic leucine zipper kinase. ACS Med Chem Lett6:25-30 (2015) 
 
Maternal embryonic leucine zipper kinase
Name:Maternal embryonic leucine zipper kinase
Type:Enzyme
Mol. Mass.:74665.45
Organism:Homo sapiens (Human)
Description:Q14680
Residue:651
BDBM50043344
NameBDBM50043344
Synonyms:CHEMBL3355057
TypeSmall organic molecule
Emp. Form.C17H17BrN2O
Mol. Mass.345.234
SMILESBrc1ccc(cc1)C(=O)Nc1ccc2CCNCCc2c1