Reaction Details
TargetMaternal embryonic leucine zipper kinase
LigandBDBM50043341
Substrate/Competitorn/a
Meas. Tech.ChEMBL_1444838 (CHEMBL3379608)
IC50 37±n/a nM
Citation Johnson, CNAdelinet, CBerdini, VBeke, LBonnet, PBrehmer, DCalo, FCoyle, JEDay, PJFrederickson, MFreyne, EJGilissen, RAHamlett, CCHoward, SMeerpoel, LMevellec, LMcMenamin, RPasquier, EPatel, SRees, DCLinders, JT Structure-Based Design of Type II Inhibitors Applied to Maternal Embryonic Leucine Zipper Kinase. ACS Med Chem Lett6:31-6 (2015) 
 
Maternal embryonic leucine zipper kinase
Name:Maternal embryonic leucine zipper kinase
Type:Enzyme
Mol. Mass.:74665.45
Organism:Homo sapiens (Human)
Description:Q14680
Residue:651
BDBM50043341
NameBDBM50043341
Synonyms:CHEMBL3355059
TypeSmall organic molecule
Emp. Form.C21H22N4O2
Mol. Mass.362.425
SMILESCOc1cc(ccc1C(=O)Nc1ccc2CCNCCc2c1)-c1cn[nH]c1