Reaction Details
TargetVascular endothelial growth factor receptor 1
LigandBDBM50043380
Substrate/Competitorn/a
Meas. Tech.ChEMBL_1444840 (CHEMBL3379610)
IC50 20±n/a nM
Citation Johnson, CNAdelinet, CBerdini, VBeke, LBonnet, PBrehmer, DCalo, FCoyle, JEDay, PJFrederickson, MFreyne, EJGilissen, RAHamlett, CCHoward, SMeerpoel, LMevellec, LMcMenamin, RPasquier, EPatel, SRees, DCLinders, JT Structure-Based Design of Type II Inhibitors Applied to Maternal Embryonic Leucine Zipper Kinase. ACS Med Chem Lett6:31-6 (2015) 
 
Vascular endothelial growth factor receptor 1
Name:Vascular endothelial growth factor receptor 1
Type:Receptor Tyrosine Kinase
Mol. Mass.:150800.23
Organism:Homo sapiens (Human)
Description:P17948
Residue:1338
BDBM50043380
NameBDBM50043380
Synonyms:CHEMBL3355065
TypeSmall organic molecule
Emp. Form.C25H25F3N4O
Mol. Mass.454.4874
SMILESCNc1cc2ccc(cc2cn1)C#CCOc1ccc(CN2CCNCC2)c(c1)C(F)(F)F