Reaction Details
TargetVascular endothelial growth factor receptor 3
LigandBDBM50043380
Substrate/Competitorn/a
Meas. Tech.ChEMBL_1444844 (CHEMBL3379614)
IC50 30±n/a nM
Citation Johnson, CNAdelinet, CBerdini, VBeke, LBonnet, PBrehmer, DCalo, FCoyle, JEDay, PJFrederickson, MFreyne, EJGilissen, RAHamlett, CCHoward, SMeerpoel, LMevellec, LMcMenamin, RPasquier, EPatel, SRees, DCLinders, JT Structure-Based Design of Type II Inhibitors Applied to Maternal Embryonic Leucine Zipper Kinase. ACS Med Chem Lett6:31-6 (2015) 
 
Vascular endothelial growth factor receptor 3
Name:Vascular endothelial growth factor receptor 3
Type:Protein
Mol. Mass.:152749.58
Organism:Homo sapiens (Human)
Description:P35916-2
Residue:1363
BDBM50043380
NameBDBM50043380
Synonyms:CHEMBL3355065
TypeSmall organic molecule
Emp. Form.C25H25F3N4O
Mol. Mass.454.4874
SMILESCNc1cc2ccc(cc2cn1)C#CCOc1ccc(CN2CCNCC2)c(c1)C(F)(F)F