Reaction Details
TargetSerine/threonine-protein kinase ATR
LigandBDBM50043410
Substrate/Competitorn/a
Meas. Tech.ChEMBL_1444990 (CHEMBL3372398)
IC50 1.000000±n/a nM
Citation Barsanti, PAPan, YLu, YJain, RCox, MAversa, RJDillon, MPElling, RHu, CJin, XKnapp, MLan, JRamurthy, SRudewicz, PSetti, LSubramanian, SMathur, MTaricani, LThomas, GXiao, LYue, Q Structure-Based Drug Design of Novel, Potent, and Selective Azabenzimidazoles (ABI) as ATR Inhibitors. ACS Med Chem Lett6:42-6 (2015) 
 
Serine/threonine-protein kinase ATR
Name:Serine/threonine-protein kinase ATR
Type:Protein
Mol. Mass.:301404.58
Organism:Homo sapiens (Human)
Description:Q13535
Residue:2644
BDBM50043410
NameBDBM50043410
Synonyms:CHEMBL3355473
TypeSmall organic molecule
Emp. Form.C21H23N5O3S
Mol. Mass.425.504
SMILESC[C@@H]1COCCN1c1nc(cc2n(CS(C)(=O)=O)cnc12)-c1cccc2[nH]ccc12