Reaction Details
TargetInterleukin-1 receptor-associated kinase 4
LigandBDBM50043416
Substrate/Competitorn/a
Meas. Tech.ChEMBL_1445027 (CHEMBL3372435)
IC50>100000±n/a nM
Citation Goodwin, NCCianchetta, GBurgoon, HAHealy, JMabon, RStrobel, EDAllen, JWang, SHamman, BDRawlins, DB Discovery of a Type III Inhibitor of LIM Kinase 2 That Binds in a DFG-Out Conformation. ACS Med Chem Lett6:53-7 (2015) 
 
Interleukin-1 receptor-associated kinase 4
Name:Interleukin-1 receptor-associated kinase 4
Type:Protein
Mol. Mass.:51519.08
Organism:Homo sapiens (Human)
Description:Q9NWZ3
Residue:460
BDBM50043416
NameBDBM50043416
Synonyms:CHEMBL3355482
TypeSmall organic molecule
Emp. Form.C21H20N2O3S
Mol. Mass.380.46
SMILESCN(Cc1ccccc1)C(=O)c1ccc(cc1)S(=O)(=O)Nc1ccccc1