Reaction Details
TargetLIM domain kinase 2
LigandBDBM50043422
Substrate/Competitorn/a
Meas. Tech.ChEMBL_1445025 (CHEMBL3372433)
IC50 1500±n/a nM
Citation Goodwin, NCCianchetta, GBurgoon, HAHealy, JMabon, RStrobel, EDAllen, JWang, SHamman, BDRawlins, DB Discovery of a Type III Inhibitor of LIM Kinase 2 That Binds in a DFG-Out Conformation. ACS Med Chem Lett6:53-7 (2015) 
 
LIM domain kinase 2
Name:LIM domain kinase 2
Type:PROTEIN
Mol. Mass.:72238.81
Organism:Homo sapiens (Human)
Description:ChEMBL_1514398
Residue:638
BDBM50043422
NameBDBM50043422
Synonyms:CHEMBL3355512
TypeSmall organic molecule
Emp. Form.C23H25N3O3S
Mol. Mass.423.528
SMILESNCCCN(Cc1ccccc1)C(=O)c1ccc(cc1)S(=O)(=O)Nc1ccccc1