Reaction Details
TargetLIM domain kinase 2
LigandBDBM50043543
Substrate/Competitorn/a
Meas. Tech.ChEMBL_1445025 (CHEMBL3372433)
IC50 110±n/a nM
Citation Goodwin, NCCianchetta, GBurgoon, HAHealy, JMabon, RStrobel, EDAllen, JWang, SHamman, BDRawlins, DB Discovery of a Type III Inhibitor of LIM Kinase 2 That Binds in a DFG-Out Conformation. ACS Med Chem Lett6:53-7 (2015) 
 
LIM domain kinase 2
Name:LIM domain kinase 2
Type:PROTEIN
Mol. Mass.:72238.81
Organism:Homo sapiens (Human)
Description:ChEMBL_1514398
Residue:638
BDBM50043543
NameBDBM50043543
Synonyms:CHEMBL3355505
TypeSmall organic molecule
Emp. Form.C22H22N2O3S
Mol. Mass.394.487
SMILESC[C@H](N(C)C(=O)c1ccc(cc1)S(=O)(=O)Nc1ccccc1)c1ccccc1