Reaction Details
TargetLIM domain kinase 2
LigandBDBM50043626
Substrate/Competitorn/a
Meas. Tech.ChEMBL_1445025 (CHEMBL3372433)
IC50 24100±n/a nM
Citation Goodwin, NCCianchetta, GBurgoon, HAHealy, JMabon, RStrobel, EDAllen, JWang, SHamman, BDRawlins, DB Discovery of a Type III Inhibitor of LIM Kinase 2 That Binds in a DFG-Out Conformation. ACS Med Chem Lett6:53-7 (2015) 
 
LIM domain kinase 2
Name:LIM domain kinase 2
Type:PROTEIN
Mol. Mass.:72238.81
Organism:Homo sapiens (Human)
Description:ChEMBL_1514398
Residue:638
BDBM50043626
NameBDBM50043626
Synonyms:CHEMBL3355488
TypeSmall organic molecule
Emp. Form.C22H22N2O4S
Mol. Mass.410.486
SMILESCOc1ccc(NS(=O)(=O)c2ccc(cc2)C(=O)N(C)Cc2ccccc2)cc1