Reaction Details
TargetWee1-like protein kinase
LigandBDBM50043635
Substrate/Competitorn/a
Meas. Tech.ChEMBL_1445052 (CHEMBL3372984)
Ki>3140±n/a nM
Citation Tong, YTorrent, MFlorjancic, ASBromberg, KDBuchanan, FGFerguson, DCJohnson, EFLasko, LMMaag, DMerta, PJOlson, AMOsterling, DJSoni, NShoemaker, ARPenning, TD Pyrimidine-based tricyclic molecules as potent and orally efficacious inhibitors of wee1 kinase. ACS Med Chem Lett6:58-62 (2015) 
 
Wee1-like protein kinase
Name:Wee1-like protein kinase
Type:PROTEIN
Mol. Mass.:71599.12
Organism:Homo sapiens (Human)
Description:ChEMBL_1445054
Residue:646
BDBM50043635
NameBDBM50043635
Synonyms:CHEMBL3355520
TypeSmall organic molecule
Emp. Form.C20H19ClN6O
Mol. Mass.394.857
SMILESClc1ccccc1-n1c2nccn2c2nc(NC3CCCCC3)ncc2c1=O