Reaction Details
TargetWee1-like protein kinase
LigandBDBM50043636
Substrate/Competitorn/a
Meas. Tech.ChEMBL_1445052 (CHEMBL3372984)
Ki 87±n/a nM
Citation Tong, YTorrent, MFlorjancic, ASBromberg, KDBuchanan, FGFerguson, DCJohnson, EFLasko, LMMaag, DMerta, PJOlson, AMOsterling, DJSoni, NShoemaker, ARPenning, TD Pyrimidine-based tricyclic molecules as potent and orally efficacious inhibitors of wee1 kinase. ACS Med Chem Lett6:58-62 (2015) 
 
Wee1-like protein kinase
Name:Wee1-like protein kinase
Type:PROTEIN
Mol. Mass.:71599.12
Organism:Homo sapiens (Human)
Description:ChEMBL_1445054
Residue:646
BDBM50043636
NameBDBM50043636
Synonyms:CHEMBL3355521
TypeSmall organic molecule
Emp. Form.C26H23ClN6O
Mol. Mass.470.953
SMILESClc1ccccc1-n1c2nccn2c2nc(Nc3ccc(cc3)C3CCCCC3)ncc2c1=O