Reaction Details
TargetWee1-like protein kinase
LigandBDBM50043641
Substrate/Competitorn/a
Meas. Tech.ChEMBL_1445052 (CHEMBL3372984)
Ki>3140±n/a nM
Citation Tong, YTorrent, MFlorjancic, ASBromberg, KDBuchanan, FGFerguson, DCJohnson, EFLasko, LMMaag, DMerta, PJOlson, AMOsterling, DJSoni, NShoemaker, ARPenning, TD Pyrimidine-based tricyclic molecules as potent and orally efficacious inhibitors of wee1 kinase. ACS Med Chem Lett6:58-62 (2015) 
 
Wee1-like protein kinase
Name:Wee1-like protein kinase
Type:PROTEIN
Mol. Mass.:71599.12
Organism:Homo sapiens (Human)
Description:ChEMBL_1445054
Residue:646
BDBM50043641
NameBDBM50043641
Synonyms:CHEMBL3355526
TypeSmall organic molecule
Emp. Form.C25H23ClN8O
Mol. Mass.486.956
SMILESCN1CCN(CC1)c1ccccc1Nc1ncc2c(n1)n1ccnc1n(-c1ccccc1Cl)c2=O