Reaction Details
TargetWee1-like protein kinase
LigandBDBM50043645
Substrate/Competitorn/a
Meas. Tech.ChEMBL_1445052 (CHEMBL3372984)
Ki 7.4±n/a nM
Citation Tong, YTorrent, MFlorjancic, ASBromberg, KDBuchanan, FGFerguson, DCJohnson, EFLasko, LMMaag, DMerta, PJOlson, AMOsterling, DJSoni, NShoemaker, ARPenning, TD Pyrimidine-based tricyclic molecules as potent and orally efficacious inhibitors of wee1 kinase. ACS Med Chem Lett6:58-62 (2015) 
 
Wee1-like protein kinase
Name:Wee1-like protein kinase
Type:PROTEIN
Mol. Mass.:71599.12
Organism:Homo sapiens (Human)
Description:ChEMBL_1445054
Residue:646
BDBM50043645
NameBDBM50043645
Synonyms:CHEMBL3355530
TypeSmall organic molecule
Emp. Form.C24H20ClN7O
Mol. Mass.457.915
SMILESCN1CCCc2cc(Nc3ncc4c(n3)n3ccnc3n(-c3ccccc3Cl)c4=O)ccc12