Reaction Details
TargetWee1-like protein kinase
LigandBDBM50043649
Substrate/Competitorn/a
Meas. Tech.ChEMBL_1445052 (CHEMBL3372984)
Ki<1.000000±n/a nM
Citation Tong, YTorrent, MFlorjancic, ASBromberg, KDBuchanan, FGFerguson, DCJohnson, EFLasko, LMMaag, DMerta, PJOlson, AMOsterling, DJSoni, NShoemaker, ARPenning, TD Pyrimidine-based tricyclic molecules as potent and orally efficacious inhibitors of wee1 kinase. ACS Med Chem Lett6:58-62 (2015) 
 
Wee1-like protein kinase
Name:Wee1-like protein kinase
Type:PROTEIN
Mol. Mass.:71599.12
Organism:Homo sapiens (Human)
Description:ChEMBL_1445054
Residue:646
BDBM50043649
NameBDBM50043649
Synonyms:CHEMBL3355534
TypeSmall organic molecule
Emp. Form.C25H22Cl2N8O
Mol. Mass.521.401
SMILESCN1CCN(CC1)c1ccc(Nc2ncc3c(n2)n2ccnc2n(-c2c(Cl)cccc2Cl)c3=O)cc1