Reaction Details
TargetWee1-like protein kinase
LigandBDBM50043637
Substrate/Competitorn/a
Meas. Tech.ChEMBL_1445054 (CHEMBL3372986)
EC50 3800±n/a nM
Citation Tong, YTorrent, MFlorjancic, ASBromberg, KDBuchanan, FGFerguson, DCJohnson, EFLasko, LMMaag, DMerta, PJOlson, AMOsterling, DJSoni, NShoemaker, ARPenning, TD Pyrimidine-based tricyclic molecules as potent and orally efficacious inhibitors of wee1 kinase. ACS Med Chem Lett6:58-62 (2015) 
 
Wee1-like protein kinase
Name:Wee1-like protein kinase
Type:PROTEIN
Mol. Mass.:71599.12
Organism:Homo sapiens (Human)
Description:ChEMBL_1445054
Residue:646
BDBM50043637
NameBDBM50043637
Synonyms:CHEMBL3355522
TypeSmall organic molecule
Emp. Form.C25H22ClN7O
Mol. Mass.471.941
SMILESClc1ccccc1-n1c2nccn2c2nc(Nc3ccc(cc3)N3CCCCC3)ncc2c1=O