Reaction Details
TargetWee1-like protein kinase
LigandBDBM50043642
Substrate/Competitorn/a
Meas. Tech.ChEMBL_1445054 (CHEMBL3372986)
EC50 6000±n/a nM
Citation Tong, YTorrent, MFlorjancic, ASBromberg, KDBuchanan, FGFerguson, DCJohnson, EFLasko, LMMaag, DMerta, PJOlson, AMOsterling, DJSoni, NShoemaker, ARPenning, TD Pyrimidine-based tricyclic molecules as potent and orally efficacious inhibitors of wee1 kinase. ACS Med Chem Lett6:58-62 (2015) 
 
Wee1-like protein kinase
Name:Wee1-like protein kinase
Type:PROTEIN
Mol. Mass.:71599.12
Organism:Homo sapiens (Human)
Description:ChEMBL_1445054
Residue:646
BDBM50043642
NameBDBM50043642
Synonyms:CHEMBL3355527
TypeSmall organic molecule
Emp. Form.C24H19ClN6O
Mol. Mass.442.9
SMILESClc1ccccc1-n1c2nccn2c2nc(Nc3ccc4CCCCc4c3)ncc2c1=O