Reaction Details
TargetWee1-like protein kinase
LigandBDBM50043648
Substrate/Competitorn/a
Meas. Tech.ChEMBL_1445054 (CHEMBL3372986)
EC50 98±n/a nM
Citation Tong, YTorrent, MFlorjancic, ASBromberg, KDBuchanan, FGFerguson, DCJohnson, EFLasko, LMMaag, DMerta, PJOlson, AMOsterling, DJSoni, NShoemaker, ARPenning, TD Pyrimidine-based tricyclic molecules as potent and orally efficacious inhibitors of wee1 kinase. ACS Med Chem Lett6:58-62 (2015) 
 
Wee1-like protein kinase
Name:Wee1-like protein kinase
Type:PROTEIN
Mol. Mass.:71599.12
Organism:Homo sapiens (Human)
Description:ChEMBL_1445054
Residue:646
BDBM50043648
NameBDBM50043648
Synonyms:CHEMBL3355533
TypeSmall organic molecule
Emp. Form.C26H24ClN7O
Mol. Mass.485.968
SMILESCN1Cc2cc(Nc3ncc4c(n3)n3ccnc3n(-c3ccccc3Cl)c4=O)ccc2C(C)(C)C1