Reaction Details
TargetWee1-like protein kinase
LigandBDBM50043654
Substrate/Competitorn/a
Meas. Tech.ChEMBL_1445054 (CHEMBL3372986)
EC50 60±n/a nM
Citation Tong, YTorrent, MFlorjancic, ASBromberg, KDBuchanan, FGFerguson, DCJohnson, EFLasko, LMMaag, DMerta, PJOlson, AMOsterling, DJSoni, NShoemaker, ARPenning, TD Pyrimidine-based tricyclic molecules as potent and orally efficacious inhibitors of wee1 kinase. ACS Med Chem Lett6:58-62 (2015) 
 
Wee1-like protein kinase
Name:Wee1-like protein kinase
Type:PROTEIN
Mol. Mass.:71599.12
Organism:Homo sapiens (Human)
Description:ChEMBL_1445054
Residue:646
BDBM50043654
NameBDBM50043654
Synonyms:CHEMBL3355539
TypeSmall organic molecule
Emp. Form.C26H23ClFN7O
Mol. Mass.503.959
SMILESCN1Cc2cc(Nc3ncc4c(n3)n3ccnc3n(-c3c(F)cccc3Cl)c4=O)ccc2C(C)(C)C1