Reaction Details
TargetSerine/threonine-protein kinase Sgk3
LigandBDBM50443628
Substrate/Competitorn/a
Meas. Tech.ChEMBL_1445194 (CHEMBL3375446)
IC50 3100±n/a nM
Citation Halland, NSchmidt, FWeiss, TSaas, JLi, ZCzech, JDreyer, MHofmeister, AMertsch, KDietz, UStrübing, CNazare, M Discovery of N-[4-(1H-Pyrazolo[3,4-b]pyrazin-6-yl)-phenyl]-sulfonamides as Highly Active and Selective SGK1 Inhibitors. ACS Med Chem Lett6:73-8 (2015) 
 
Serine/threonine-protein kinase Sgk3
Name:Serine/threonine-protein kinase Sgk3
Type:PROTEIN
Mol. Mass.:57110.99
Organism:Homo sapiens (Human)
Description:ChEMBL_1445194
Residue:496
BDBM50443628
NameBDBM50443628
Synonyms:CHEMBL3092468 US9221828, 35
TypeSmall organic molecule
Emp. Form.C17H12ClFN6O2S
Mol. Mass.418.833
SMILESNc1n[nH]c2nc(cnc12)-c1ccc(NS(=O)(=O)c2cc(Cl)ccc2F)cc1