Reaction Details
TargetSerine/threonine-protein kinase Sgk1
LigandBDBM50043780
Substrate/Competitorn/a
Meas. Tech.ChEMBL_1445188 (CHEMBL3375440)
IC50 2.0±n/a nM
Citation Halland, NSchmidt, FWeiss, TSaas, JLi, ZCzech, JDreyer, MHofmeister, AMertsch, KDietz, UStrübing, CNazare, M Discovery of N-[4-(1H-Pyrazolo[3,4-b]pyrazin-6-yl)-phenyl]-sulfonamides as Highly Active and Selective SGK1 Inhibitors. ACS Med Chem Lett6:73-8 (2015) 
 
Serine/threonine-protein kinase Sgk1
Name:Serine/threonine-protein kinase Sgk1
Type:Other Protein Type
Mol. Mass.:48954.40
Organism:Homo sapiens (Human)
Description:Recombinant human SGK-1 enzyme produced in a baculovirus system.
Residue:431
BDBM50043780
NameBDBM50043780
Synonyms:CHEMBL3356050
TypeSmall organic molecule
Emp. Form.C18H15FN6O3S
Mol. Mass.414.414
SMILESCOc1ccc(F)c(c1)S(=O)(=O)Nc1ccc(cc1)-c1cnc2c(N)n[nH]c2n1