Reaction Details
TargetLIM domain kinase 2
LigandBDBM50044003
Substrate/Competitorn/a
Meas. Tech.ChEMBL_1445332 (CHEMBL3377887)
IC50 2.7±n/a nM
Citation Harrison, BAAlmstead, ZYBurgoon, HGardyan, MGoodwin, NCHealy, JLiu, YMabon, RMarinelli, BSamala, LZhang, YStouch, TRWhitlock, NAGopinathan, SMcKnight, BWang, SPatel, NWilson, AGHamman, BDRice, DSRawlins, DB Discovery and Development of LX7101, a Dual LIM-Kinase and ROCK Inhibitor for the Treatment of Glaucoma. ACS Med Chem Lett6:84-8 (2015) 
 
LIM domain kinase 2
Name:LIM domain kinase 2
Type:PROTEIN
Mol. Mass.:72238.81
Organism:Homo sapiens (Human)
Description:ChEMBL_1514398
Residue:638
BDBM50044003
NameBDBM50044003
Synonyms:CHEMBL3356430
TypeSmall organic molecule
Emp. Form.C26H34N6O5
Mol. Mass.510.5854
SMILESCOCCOCC1(CCN(CC1)c1ncnc2[nH]cc(C)c12)C(=O)Nc1cccc(OC(=O)N(C)C)c1