Reaction Details
TargetLIM domain kinase 2
LigandBDBM50044008
Substrate/Competitorn/a
Meas. Tech.ChEMBL_1445332 (CHEMBL3377887)
IC50 138±n/a nM
Citation Harrison, BAAlmstead, ZYBurgoon, HGardyan, MGoodwin, NCHealy, JLiu, YMabon, RMarinelli, BSamala, LZhang, YStouch, TRWhitlock, NAGopinathan, SMcKnight, BWang, SPatel, NWilson, AGHamman, BDRice, DSRawlins, DB Discovery and Development of LX7101, a Dual LIM-Kinase and ROCK Inhibitor for the Treatment of Glaucoma. ACS Med Chem Lett6:84-8 (2015) 
 
LIM domain kinase 2
Name:LIM domain kinase 2
Type:PROTEIN
Mol. Mass.:72238.81
Organism:Homo sapiens (Human)
Description:ChEMBL_1514398
Residue:638
BDBM50044008
NameBDBM50044008
Synonyms:CHEMBL3356428
TypeSmall organic molecule
Emp. Form.C22H26N6O4
Mol. Mass.438.4796
SMILESCN(C)C(=O)Oc1cccc(NC(=O)C2(O)CCN(CC2)c2ncnc3[nH]cc(C)c23)c1