Reaction Details
TargetLIM domain kinase 2
LigandBDBM50044012
Substrate/Competitorn/a
Meas. Tech.ChEMBL_1445332 (CHEMBL3377887)
IC50 1.9±n/a nM
Citation Harrison, BAAlmstead, ZYBurgoon, HGardyan, MGoodwin, NCHealy, JLiu, YMabon, RMarinelli, BSamala, LZhang, YStouch, TRWhitlock, NAGopinathan, SMcKnight, BWang, SPatel, NWilson, AGHamman, BDRice, DSRawlins, DB Discovery and Development of LX7101, a Dual LIM-Kinase and ROCK Inhibitor for the Treatment of Glaucoma. ACS Med Chem Lett6:84-8 (2015) 
 
LIM domain kinase 2
Name:LIM domain kinase 2
Type:PROTEIN
Mol. Mass.:72238.81
Organism:Homo sapiens (Human)
Description:ChEMBL_1514398
Residue:638
BDBM50044012
NameBDBM50044012
Synonyms:CHEMBL3356424
TypeSmall organic molecule
Emp. Form.C22H24ClN5O
Mol. Mass.409.912
SMILESCc1c[nH]c2ncnc(N3CCC(CC=C)(CC3)C(=O)Nc3cccc(Cl)c3)c12