Reaction Details
TargetLIM domain kinase 2
LigandBDBM50044086
Substrate/Competitorn/a
Meas. Tech.ChEMBL_1445332 (CHEMBL3377887)
IC50 1.2±n/a nM
Citation Harrison, BAAlmstead, ZYBurgoon, HGardyan, MGoodwin, NCHealy, JLiu, YMabon, RMarinelli, BSamala, LZhang, YStouch, TRWhitlock, NAGopinathan, SMcKnight, BWang, SPatel, NWilson, AGHamman, BDRice, DSRawlins, DB Discovery and Development of LX7101, a Dual LIM-Kinase and ROCK Inhibitor for the Treatment of Glaucoma. ACS Med Chem Lett6:84-8 (2015) 
 
LIM domain kinase 2
Name:LIM domain kinase 2
Type:PROTEIN
Mol. Mass.:72238.81
Organism:Homo sapiens (Human)
Description:ChEMBL_1514398
Residue:638
BDBM50044086
NameBDBM50044086
Synonyms:CHEMBL3356064
TypeSmall organic molecule
Emp. Form.C19H22N6O
Mol. Mass.350.4176
SMILESC[C@H]1CN(CCN1C(=O)Nc1ccccc1)c1ncnc2[nH]cc(C)c12