Reaction Details
TargetRho-associated protein kinase 1
LigandBDBM50044006
Substrate/Competitorn/a
Meas. Tech.ChEMBL_1445334 (CHEMBL3377889)
IC50 514±n/a nM
Citation Harrison, BAAlmstead, ZYBurgoon, HGardyan, MGoodwin, NCHealy, JLiu, YMabon, RMarinelli, BSamala, LZhang, YStouch, TRWhitlock, NAGopinathan, SMcKnight, BWang, SPatel, NWilson, AGHamman, BDRice, DSRawlins, DB Discovery and Development of LX7101, a Dual LIM-Kinase and ROCK Inhibitor for the Treatment of Glaucoma. ACS Med Chem Lett6:84-8 (2015) 
 
Rho-associated protein kinase 1
Name:Rho-associated protein kinase 1
Type:Serine/threonine-protein kinase
Mol. Mass.:158156.77
Organism:Homo sapiens (Human)
Description:Q13464
Residue:1354
BDBM50044006
NameBDBM50044006
Synonyms:CHEMBL3356431
TypeSmall organic molecule
Emp. Form.C26H30N8O3
Mol. Mass.502.5682
SMILESCN(C)C(=O)Oc1cccc(NC(=O)C2(Cc3c[nH]cn3)CCN(CC2)c2ncnc3[nH]cc(C)c23)c1