Reaction Details
TargetRho-associated protein kinase 1
LigandBDBM50044004
Substrate/Competitorn/a
Meas. Tech.ChEMBL_1445338 (CHEMBL3378490)
IC50 2200±n/a nM
Citation Harrison, BAAlmstead, ZYBurgoon, HGardyan, MGoodwin, NCHealy, JLiu, YMabon, RMarinelli, BSamala, LZhang, YStouch, TRWhitlock, NAGopinathan, SMcKnight, BWang, SPatel, NWilson, AGHamman, BDRice, DSRawlins, DB Discovery and Development of LX7101, a Dual LIM-Kinase and ROCK Inhibitor for the Treatment of Glaucoma. ACS Med Chem Lett6:84-8 (2015) 
 
Rho-associated protein kinase 1
Name:Rho-associated protein kinase 1
Type:Serine/threonine-protein kinase
Mol. Mass.:158156.77
Organism:Homo sapiens (Human)
Description:Q13464
Residue:1354
BDBM50044004
NameBDBM50044004
Synonyms:CHEMBL3356433
TypeSmall organic molecule
Emp. Form.C23H29N7O3
Mol. Mass.451.5215
SMILESCN(C)C(=O)Oc1cccc(NC(=O)C2(CN)CCN(CC2)c2ncnc3[nH]cc(C)c23)c1